Target
Mitogen-activated protein kinase 13
Ligand
BDBM50473623
Substrate
Meas. Tech.
ChEMBL_124318 (CHEMBL732626)
IC50
4.0±n/a nM
Citation
 McKenna, JMHalley, FSouness, JEMcLay, IMPickett, SDCollis, AJPage, KAhmed, I An algorithm-directed two-component library synthesized via solid-phase methodology yielding potent and orally bioavailable p38 MAP kinase inhibitors. J Med Chem 45:2173-84 (2002)  
Target
Name:
Mitogen-activated protein kinase 13
Synonyms:
MAP kinase 13 MAPK 13 Mapk13 Mitogen-activated protein kinase p38 delta Stress-activated protein kinase 4
Type:
PROTEIN
Mol. Mass.:
42081.17
Organism:
Mus musculus
Description:
ChEMBL_105000
Residue:
366
  
Inhibitor
Name:
BDBM50473623
Synonyms:
CHEMBL309802 | RPR-238778
Type:
Small organic molecule
Emp. Form.:
C27H28FN7O3
Mol. Mass.:
517.5547
SMILES:
CN(C)C(=O)[C@@]1(C)CO[C@@H](OC1)c1nc(c([nH]1)-c1ccnc(NCc2ccccn2)n1)-c1ccc(F)cc1
: