Target
Stromelysin-1
Ligand
BDBM50240611
Substrate
Meas. Tech.
ChEMBL_104903 (CHEMBL713439)
Ki
15±n/a nM
Citation
 Kottirsch, GKoch, GFeifel, RNeumann, U Beta-aryl-succinic acid hydroxamates as dual inhibitors of matrix metalloproteinases and tumor necrosis factor alpha converting enzyme. J Med Chem 45:2289-93 (2002)  
Target
Name:
Stromelysin-1
Synonyms:
MMP-3 MMP3_HUMAN Matrix metalloproteinase 3 Matrix metalloproteinase-3 (MMP-3) SL-1 Stromelysin 1 | Transin-1
Type:
Enzyme
Mol. Mass.:
53973.13
Organism:
Homo sapiens (Human)
Description:
P08254
Residue:
477
  
Inhibitor
Name:
BDBM50240611
Synonyms:
(2S,3R)-N1-((S)-3,3-dimethyl-1-(methylamino)-1-oxobutan-2-yl)-N4-hydroxy-3-(hydroxymethyl)-2-p-tolylsuccinamide N*4*-(2,2-Dimethyl-1-methylcarbamoyl-propyl)-N*1*-hydroxy-2-hydroxymethyl-3-p-tolyl-succinamide | PKF-241-466
Type:
Small organic molecule
Emp. Form.:
C19H29N3O5
Mol. Mass.:
379.4507
SMILES:
CNC(=O)[C@@H](NC(=O)[C@@H]([C@H](CO)C(=O)NO)c1ccc(C)cc1)C(C)(C)C
: