Target
Delta-type opioid receptor
Ligand
BDBM82551
Substrate
Meas. Tech.
ChEMBL_303324 (CHEMBL840049)
Ki
5.8±n/a nM
Citation
 Chauvignac, CMiller, CNSrivastava, SKLewis, JWHusbands, SMTraynor, JR Major effect of pyrrolic N-benzylation in norbinaltorphimine, the selective kappa-opioid receptor antagonist. J Med Chem 48:1676-9 (2005)  
Target
Name:
Delta-type opioid receptor
Synonyms:
Cytochrome P450 3A4 Delta opioid receptor Delta-type opioid receptor (DOR) OPRD_RAT Opioid receptor Opioid receptors; mu & delta Ror-a | Voltage-gated potassium channel
Type:
G Protein-Coupled Receptor (GPCR)
Mol. Mass.:
40465.04
Organism:
Rattus norvegicus (rat)
Description:
Competition binding assays were using CHO-K1 cell membranes expressing the opioid receptor.
Residue:
372
  
Inhibitor
Name:
BDBM82551
Synonyms:
C18130 NOR-BNI (HCI)2 | NORBNI
Type:
Small organic molecule
Emp. Form.:
C40H43N3O6
Mol. Mass.:
661.7859
SMILES:
Oc1ccc2C[C@H]3N(CC4CC4)CC[C@@]45[C@@H](Oc1c24)c1[nH]c2[C@@H]4Oc6c7c(C[C@H]8N(CC9CC9)CC[C@@]47[C@@]8(O)Cc2c1C[C@@]35O)ccc6O
: