Target
Mu-type opioid receptor
Ligand
BDBM50475336
Substrate
Meas. Tech.
ChEMBL_303266 (CHEMBL828260)
Ki
64±n/a nM
Citation
 Chauvignac, CMiller, CNSrivastava, SKLewis, JWHusbands, SMTraynor, JR Major effect of pyrrolic N-benzylation in norbinaltorphimine, the selective kappa-opioid receptor antagonist. J Med Chem 48:1676-9 (2005)  
Target
Name:
Mu-type opioid receptor
Synonyms:
MOR-1 Mu-type opioid receptor (MOR) OPRM_RAT Opioid receptor B Ror-b
Type:
G Protein-Coupled Receptor (GPCR)
Mol. Mass.:
44503.11
Organism:
Rattus norvegicus (rat)
Description:
Competition binding assays were carried out using membrane preparations from transfected HN9.10 cells that constitutively expressed the mu opioid receptor.
Residue:
398
  
Inhibitor
Name:
BDBM50475336
Synonyms:
CHEMBL606959
Type:
Small organic molecule
Emp. Form.:
C34H35N3O6
Mol. Mass.:
581.6582
SMILES:
[H][C@@]12Oc3c4c(C[C@@]5([H])N(C)CC[C@@]14[C@@]5(O)Cc1c4C[C@@]5(O)[C@@]6([H])Cc7ccc(O)c8O[C@@]([H])(c4[nH]c21)[C@]5(CCN6C)c78)ccc3O
: