Target
Delta-type opioid receptor
Ligand
BDBM50475335
Substrate
Meas. Tech.
ChEMBL_303324 (CHEMBL840049)
Ki
8.6±n/a nM
Citation
 Chauvignac, CMiller, CNSrivastava, SKLewis, JWHusbands, SMTraynor, JR Major effect of pyrrolic N-benzylation in norbinaltorphimine, the selective kappa-opioid receptor antagonist. J Med Chem 48:1676-9 (2005)  
Target
Name:
Delta-type opioid receptor
Synonyms:
Cytochrome P450 3A4 Delta opioid receptor Delta-type opioid receptor (DOR) OPRD_RAT Opioid receptor Opioid receptors; mu & delta Ror-a | Voltage-gated potassium channel
Type:
G Protein-Coupled Receptor (GPCR)
Mol. Mass.:
40465.04
Organism:
Rattus norvegicus (rat)
Description:
Competition binding assays were using CHO-K1 cell membranes expressing the opioid receptor.
Residue:
372
  
Inhibitor
Name:
BDBM50475335
Synonyms:
CHEMBL2113078
Type:
Small organic molecule
Emp. Form.:
C47H49N3O6
Mol. Mass.:
751.9085
SMILES:
[H][C@@]12Oc3c4c(C[C@@]5([H])N(CC6CC6)CC[C@@]14[C@@]5(O)Cc1c4C[C@@]5(O)[C@@]6([H])Cc7ccc(O)c8O[C@@]([H])(c4n(Cc4ccccc4)c21)[C@]5(CCN6CC1CC1)c78)ccc3O
: