Target
Kappa-type opioid receptor
Ligand
BDBM50475336
Substrate
Meas. Tech.
ChEMBL_303356 (CHEMBL838691)
Ki
7.7±n/a nM
Citation
 Chauvignac, CMiller, CNSrivastava, SKLewis, JWHusbands, SMTraynor, JR Major effect of pyrrolic N-benzylation in norbinaltorphimine, the selective kappa-opioid receptor antagonist. J Med Chem 48:1676-9 (2005)  
Target
Name:
Kappa-type opioid receptor
Synonyms:
K-OR-1 Kappa-opioid receptor (KOR) Kappa-type opioid receptor (KOR) OPIATE Kappa OPRK1 kappa opioid receptor (KOR)
Type:
G Protein-Coupled Receptor (GPCR)
Mol. Mass.:
42648.76
Organism:
Homo sapiens (Human)
Description:
P41145
Residue:
380
  
Inhibitor
Name:
BDBM50475336
Synonyms:
CHEMBL606959
Type:
Small organic molecule
Emp. Form.:
C34H35N3O6
Mol. Mass.:
581.6582
SMILES:
[H][C@@]12Oc3c4c(C[C@@]5([H])N(C)CC[C@@]14[C@@]5(O)Cc1c4C[C@@]5(O)[C@@]6([H])Cc7ccc(O)c8O[C@@]([H])(c4[nH]c21)[C@]5(CCN6C)c78)ccc3O
: