Target
Estrogen receptor
Ligand
BDBM50475361
Substrate
Meas. Tech.
ChEMBL_304021 (CHEMBL840199)
Ki
16±n/a nM
Citation
 Hoekstra, WJPatel, HSLiang, XBlanc, JBHeyer, DOWillson, TMIannone, MAKadwell, SHMiller, LAPearce, KHSimmons, CAShearin, J Discovery of novel quinoline-based estrogen receptor ligands using peptide interaction profiling. J Med Chem 48:2243-7 (2005)  
Target
Name:
Estrogen receptor
Synonyms:
ER ESR ESR1_HUMAN Estrogen receptor Estrogen receptor (ER-alpha) Estrogen receptor alpha (ER) Nuclear receptor subfamily 3 group A member 1
Type:
Protein
Mol. Mass.:
66230.44
Organism:
Homo sapiens (Human)
Description:
P03372
Residue:
595
  
Inhibitor
Name:
BDBM50475361
Synonyms:
CHEMBL363630
Type:
Small organic molecule
Emp. Form.:
C26H22N2O3
Mol. Mass.:
410.4645
SMILES:
CCc1nc2cc(O)ccc2c(Oc2ccc(\C=C\C(N)=O)cc2)c1-c1ccccc1
: