Target
Estrogen receptor
Ligand
BDBM50276802
Substrate
Meas. Tech.
ChEMBL_304021 (CHEMBL840199)
Ki
2.5±n/a nM
Citation
 Hoekstra, WJPatel, HSLiang, XBlanc, JBHeyer, DOWillson, TMIannone, MAKadwell, SHMiller, LAPearce, KHSimmons, CAShearin, J Discovery of novel quinoline-based estrogen receptor ligands using peptide interaction profiling. J Med Chem 48:2243-7 (2005)  
Target
Name:
Estrogen receptor
Synonyms:
ER ESR ESR1_HUMAN Estrogen receptor Estrogen receptor (ER-alpha) Estrogen receptor alpha (ER) Nuclear receptor subfamily 3 group A member 1
Type:
Protein
Mol. Mass.:
66230.44
Organism:
Homo sapiens (Human)
Description:
P03372
Residue:
595
  
Inhibitor
Name:
BDBM50276802
Synonyms:
4-OHT TamoGel
Type:
Small organic molecule
Emp. Form.:
C26H29NO2
Mol. Mass.:
387.514
SMILES:
CCC(=C(c1ccc(O)cc1)c1ccc(OCCN(C)C)cc1)c1ccccc1
: