Target
Estrogen receptor beta
Ligand
BDBM50475364
Substrate
Meas. Tech.
ChEMBL_304015 (CHEMBL840098)
Ki
16±n/a nM
Citation
 Hoekstra, WJPatel, HSLiang, XBlanc, JBHeyer, DOWillson, TMIannone, MAKadwell, SHMiller, LAPearce, KHSimmons, CAShearin, J Discovery of novel quinoline-based estrogen receptor ligands using peptide interaction profiling. J Med Chem 48:2243-7 (2005)  
Target
Name:
Estrogen receptor beta
Synonyms:
ER-beta ESR2_HUMAN Estradiol receptor beta (ERβ) Estrogen receptor (ER beta) Estrogen receptor beta (ER beta) NR3A2 estrogen beta
Type:
Protein
Mol. Mass.:
59238.43
Organism:
Homo sapiens (Human)
Description:
Q92731
Residue:
530
  
Inhibitor
Name:
BDBM50475364
Synonyms:
CHEMBL370750
Type:
Small organic molecule
Emp. Form.:
C29H28N2O3
Mol. Mass.:
452.5442
SMILES:
CCc1nc2cc(O)ccc2c(Oc2ccc(\C=C\C(=O)NC(C)C)cc2)c1-c1ccccc1
: