Target
Neuronal acetylcholine receptor subunit alpha-3/beta-2
Ligand
BDBM86816
Substrate
Meas. Tech.
ChEMBL_320938 (CHEMBL882457)
Ki
0.339000±n/a nM
Citation
 Huang, YZhu, ZXiao, YLaruelle, M Epibatidine analogues as selective ligands for the alpha(x)beta2-containing subtypes of nicotinic acetylcholine receptors. Bioorg Med Chem Lett 15:4385-8 (2005)  
Target
Name:
Neuronal acetylcholine receptor subunit alpha-3/beta-2
Synonyms:
Neuronal acetylcholine receptor Alpha-3/Beta-2 Neuronal acetylcholine receptor; alpha3/beta2 | nAChR subtypes alpha3 beta2
Type:
Protein
Mol. Mass.:
Description:
Components:
This complex has 2 components.
Component 1
Name:
Neuronal acetylcholine receptor subunit alpha-3
Synonyms:
ACHA3_RAT Chrna3
Type:
Enzyme
Mol. Mass.:
56995.52
Organism:
Rattus norvegicus (Rat)
Description:
P04757
Residue:
499
  
Component 2
Name:
Neuronal acetylcholine receptor subunit beta-2
Synonyms:
ACHB2_RAT Chrnb2 Neuronal acetylcholine receptor non-alpha-1 chain
Type:
Enzyme
Mol. Mass.:
56910.32
Organism:
Rattus norvegicus (Rat)
Description:
P12390
Residue:
500
  
Inhibitor
Name:
BDBM86816
Synonyms:
CAS_45263769 rac-2-(5-(4-chlorophenyl)-6-fluoropyridin-3-yl)-7-aza-bicyclo[2.2.1]heptane hydrochloride
Type:
Small organic molecule
Emp. Form.:
C17H16ClFN2
Mol. Mass.:
302.774
SMILES:
Fc1ncc(cc1-c1ccc(Cl)cc1)C1CC2CCC1N2
: