Target
Alpha-1A adrenergic receptor
Ligand
BDBM50475534
Substrate
Meas. Tech.
ChEMBL_326680 (CHEMBL868696)
Ki
0.251189±n/a nM
Citation
 Quaglia, WSantoni, GPigini, MPiergentili, AGentili, FBuccioni, MMosca, MLucciarini, RAmantini, CNabissi, MIBallarini, PPoggesi, ELeonardi, AGiannella, M Structure-activity relationships in 1,4-benzodioxan-related compounds. 8.(1) {2-[2-(4-chlorobenzyloxy)phenoxy]ethyl}-[2-(2,6-dimethoxyphenoxy)ethyl]amine (clopenphendioxan) as a tool to highlight the involvement of alpha1D- and alpha1B-adrenoreceptor subtypes in the regulation of human PC-3 prostate J Med Chem 48:7750-63 (2005)  
Target
Name:
Alpha-1A adrenergic receptor
Synonyms:
ADA1A_HUMAN ADRA1C Alpha 1A-adrenoceptor Alpha adrenergic receptor 1a Alpha-adrenergic receptor 1c adrenergic Alpha1 | adrenergic Alpha1C
Type:
Cell-surface receptors
Mol. Mass.:
51511.67
Organism:
Homo sapiens (Human)
Description:
P35348
Residue:
466
  
Inhibitor
Name:
BDBM50475534
Synonyms:
CHEMBL198860
Type:
Small organic molecule
Emp. Form.:
C25H28ClNO5
Mol. Mass.:
457.947
SMILES:
COc1cccc(OC)c1OCCNCCOc1ccccc1OCc1cccc(Cl)c1
: