Target
Carbonic anhydrase 1
Ligand
BDBM50080728
Substrate
Meas. Tech.
ChEMBL_344234 (CHEMBL870708)
Ki
44.0±n/a nM
Citation
 Agrawal, VKSingh, JKhadikar, PVSupuran, CT QSAR study on topically acting sulfonamides incorporating GABA moieties: a molecular connectivity approach. Bioorg Med Chem Lett 16:2044-51 (2006)  
Target
Name:
Carbonic anhydrase 1
Synonyms:
CA-I CAB Carbonate dehydratase I Carbonic anhydrase 1 (CA I) Carbonic anhydrase 1 (Recombinant CA I) Carbonic anhydrase B Carbonic anhydrase I (CA I) Carbonic anhydrase I (CAI) Carbonic anhydrase isoenzyme I (hCA I) | hCA
Type:
Enzyme
Mol. Mass.:
28873.37
Organism:
Homo sapiens (Human)
Description:
P00915
Residue:
261
  
Inhibitor
Name:
BDBM50080728
Synonyms:
3-{[(4-aminophenyl)sulfonyl]amino}benzenesulfonamide 4-amino-bis-benzenesulfonamide | CHEMBL14182
Type:
Small organic molecule
Emp. Form.:
C12H13N3O4S2
Mol. Mass.:
327.379
SMILES:
Nc1ccc(cc1)S(=O)(=O)Nc1cccc(c1)S(N)(=O)=O
: