Target
Transporter
Ligand
BDBM76298
Substrate
Meas. Tech.
ChEBML_129897
IC50
>34000±n/a nM
Citation
 Högberg, TUlff, BRenyi, ALRoss, SB Synthesis of pyridylallylamines related to zimelidine and their inhibition of neuronal monoamine uptake. J Med Chem 24:1499-507 (1982)  
Target
Name:
Transporter
Synonyms:
Monoamine transporters; Norepininephrine & dopamine | Norepinephrine Monoamine transporters
Type:
PROTEIN
Mol. Mass.:
66787.87
Organism:
Rattus norvegicus
Description:
ChEMBL_1463061
Residue:
597
  
Inhibitor
Name:
BDBM76298
Synonyms:
2-aminopropanoic acid [1-(4-chlorophenyl)-2-methylpropan-2-yl] ester;hydrochloride ALAPROCLATE HYDROCHLORIDE CHEMBL36591 SMR001230852 [1-(4-chlorophenyl)-2-methylpropan-2-yl] 2-aminopropanoate;hydrochloride | cid_11957454
Type:
Small organic molecule
Emp. Form.:
C13H18ClNO2
Mol. Mass.:
255.741
SMILES:
CC(N)C(=O)OC(C)(C)Cc1ccc(Cl)cc1
: