Target
Sodium-dependent serotonin transporter
Ligand
BDBM76298
Substrate
Meas. Tech.
ChEBML_129898
IC50
700±n/a nM
Citation
 Högberg, TUlff, BRenyi, ALRoss, SB Synthesis of pyridylallylamines related to zimelidine and their inhibition of neuronal monoamine uptake. J Med Chem 24:1499-507 (1982)  
Target
Name:
Sodium-dependent serotonin transporter
Synonyms:
5-HT Transporter 5HT transporter Anandamid membrane transporter, AMT Monoamine transporters; Norepinephrine & serotonin Slc6a4 Sodium-dependent serotonin transporter (SERT) | imipramine receptor
Type:
Multi-pass membrane protein
Mol. Mass.:
70168.43
Organism:
Rattus norvegicus (rat)
Description:
P31652
Residue:
630
  
Inhibitor
Name:
BDBM76298
Synonyms:
2-aminopropanoic acid [1-(4-chlorophenyl)-2-methylpropan-2-yl] ester;hydrochloride ALAPROCLATE HYDROCHLORIDE CHEMBL36591 SMR001230852 [1-(4-chlorophenyl)-2-methylpropan-2-yl] 2-aminopropanoate;hydrochloride | cid_11957454
Type:
Small organic molecule
Emp. Form.:
C13H18ClNO2
Mol. Mass.:
255.741
SMILES:
CC(N)C(=O)OC(C)(C)Cc1ccc(Cl)cc1
: