Target
Dual specificity mitogen-activated protein kinase kinase 1/2
Ligand
BDBM50476834
Substrate
Meas. Tech.
ChEMBL_446487 (CHEMBL895599)
IC50
5.0±n/a nM
Citation
 Spicer, JARewcastle, GWKaufman, MDBlack, SLPlummer, MSDenny, WAQuin, JShahripour, ABBarrett, SDWhitehead, CEMilbank, JBOhren, JFGowan, RCOmer, CCamp, HSEsmaeil, NMoore, KSebolt-Leopold, JSPryzbranowski, SMerriman, RLOrtwine, DFWarmus, JSFlamme, CMPavlovsky, AGTecle, H 4-anilino-5-carboxamido-2-pyridone derivatives as noncompetitive inhibitors of mitogen-activated protein kinase kinase. J Med Chem 50:5090-102 (2007)  
Target
Name:
Dual specificity mitogen-activated protein kinase kinase 1/2
Synonyms:
Dual specificity mitogen-activated protein kinase kinase; MEK1/2 | p-MEK1/2
Type:
Mol. Mass.:
Description:
ASSAY_ID of ChEMBL is 795758
Components:
This complex has 2 components.
Component 1
Name:
Dual specificity mitogen-activated protein kinase kinase 2
Synonyms:
Dual specificity mitogen-activated protein kinase kinase 2 (MEK2) ERK activator kinase 2 MAP2K2 MAPKK 2 MKK2 PRKMK2 | VHL-MAP2K1/MAP2K2
Type:
Enzyme Catalytic Domain
Mol. Mass.:
44423.61
Organism:
Homo sapiens (Human)
Description:
gi_13489054
Residue:
400
  
Component 2
Name:
Dual specificity mitogen-activated protein kinase kinase 1
Synonyms:
Dual specificity mitogen-activated protein kinase (MEK) Dual specificity mitogen-activated protein kinase kinase 1 (MEK1) Dual specificity mitogen-activated protein kinase kinase MEK1/2 MAP kinase kinase 1 MAPK/ERK kinase 1 MEK-1 MP2K1_HUMAN PRKMK1 | VHL-MAP2K1/MAP2K2
Type:
Other Protein Type
Mol. Mass.:
43439.03
Organism:
Homo sapiens (Human)
Description:
Full-length human MEK-1 was generated by PCR and purified as a fusion protein from Escherichia coli lysates.
Residue:
393
  
Inhibitor
Name:
BDBM50476834
Synonyms:
CHEMBL234887
Type:
Small organic molecule
Emp. Form.:
C15H15FIN3O4
Mol. Mass.:
447.2002
SMILES:
Cn1cc(C(=O)NOCCO)c(Nc2ccc(I)cc2F)cc1=O
: