Target
Reverse transcriptase protein
Ligand
BDBM50476888
Substrate
Meas. Tech.
ChEMBL_447798 (CHEMBL896807)
IC50
23±n/a nM
Citation
 Gagnon, AAmad, MHBonneau, PRCoulombe, RDeRoy, PLDoyon, LDuan, JGarneau, MGuse, IJakalian, AJolicoeur, ELandry, SMalenfant, ESimoneau, BYoakim, C Thiotetrazole alkynylacetanilides as potent and bioavailable non-nucleoside inhibitors of the HIV-1 wild type and K103N/Y181C double mutant reverse transcriptases. Bioorg Med Chem Lett 17:4437-41 (2007)  
Target
Name:
Reverse transcriptase protein
Synonyms:
Reverse Transcriptase Reverse Transcriptase (F61A)
Type:
Protein
Mol. Mass.:
30203.56
Organism:
Human immunodeficiency virus 1
Description:
Q9WJQ2
Residue:
259
  
Inhibitor
Name:
BDBM50476888
Synonyms:
CHEMBL231777
Type:
Small organic molecule
Emp. Form.:
C26H26Cl2N6O3S
Mol. Mass.:
573.494
SMILES:
CC(C)(CNCC(O)=O)C#Cc1ccc(NC(=O)CSc2nnnn2-c2ccc(cc2Cl)C2CC2)c(Cl)c1
: