Target
Reverse transcriptase
Ligand
BDBM50476892
Substrate
Meas. Tech.
ChEMBL_447797 (CHEMBL896806)
IC50
16±n/a nM
Citation
 Gagnon, AAmad, MHBonneau, PRCoulombe, RDeRoy, PLDoyon, LDuan, JGarneau, MGuse, IJakalian, AJolicoeur, ELandry, SMalenfant, ESimoneau, BYoakim, C Thiotetrazole alkynylacetanilides as potent and bioavailable non-nucleoside inhibitors of the HIV-1 wild type and K103N/Y181C double mutant reverse transcriptases. Bioorg Med Chem Lett 17:4437-41 (2007)  
Target
Name:
Reverse transcriptase
Synonyms:
Type:
Protein
Mol. Mass.:
29598.37
Organism:
Human immunodeficiency virus 1
Description:
Q9WKE8
Residue:
254
  
Inhibitor
Name:
BDBM50476892
Synonyms:
CHEMBL391298
Type:
Small organic molecule
Emp. Form.:
C19H15Cl2N5O3S
Mol. Mass.:
464.325
SMILES:
OC(=O)c1ccc(NC(=O)CSc2nnnn2-c2ccc(cc2Cl)C2CC2)c(Cl)c1
: