Target
Reverse transcriptase
Ligand
BDBM50476893
Substrate
Meas. Tech.
ChEMBL_447797 (CHEMBL896806)
IC50
10.0±n/a nM
Citation
 Gagnon, AAmad, MHBonneau, PRCoulombe, RDeRoy, PLDoyon, LDuan, JGarneau, MGuse, IJakalian, AJolicoeur, ELandry, SMalenfant, ESimoneau, BYoakim, C Thiotetrazole alkynylacetanilides as potent and bioavailable non-nucleoside inhibitors of the HIV-1 wild type and K103N/Y181C double mutant reverse transcriptases. Bioorg Med Chem Lett 17:4437-41 (2007)  
Target
Name:
Reverse transcriptase
Synonyms:
Type:
Protein
Mol. Mass.:
29598.37
Organism:
Human immunodeficiency virus 1
Description:
Q9WKE8
Residue:
254
  
Inhibitor
Name:
BDBM50476893
Synonyms:
CHEMBL393190
Type:
Small organic molecule
Emp. Form.:
C29H29Cl2N5O3S
Mol. Mass.:
598.543
SMILES:
CC(C)(C)c1ccc(c(Cl)c1)-n1nnnc1SCC(=O)Nc1ccc(cc1Cl)-c1ccc(cc1)C(C)(C)C(O)=O
: