Target
Reverse transcriptase
Ligand
BDBM50476903
Substrate
Meas. Tech.
ChEMBL_447797 (CHEMBL896806)
IC50
3.1±n/a nM
Citation
 Gagnon, AAmad, MHBonneau, PRCoulombe, RDeRoy, PLDoyon, LDuan, JGarneau, MGuse, IJakalian, AJolicoeur, ELandry, SMalenfant, ESimoneau, BYoakim, C Thiotetrazole alkynylacetanilides as potent and bioavailable non-nucleoside inhibitors of the HIV-1 wild type and K103N/Y181C double mutant reverse transcriptases. Bioorg Med Chem Lett 17:4437-41 (2007)  
Target
Name:
Reverse transcriptase
Synonyms:
Type:
Protein
Mol. Mass.:
29598.37
Organism:
Human immunodeficiency virus 1
Description:
Q9WKE8
Residue:
254
  
Inhibitor
Name:
BDBM50476903
Synonyms:
CHEMBL230188
Type:
Small organic molecule
Emp. Form.:
C20H21Cl2N5O3S2
Mol. Mass.:
514.448
SMILES:
CC(C)(C)c1ccc(c(Cl)c1)-n1nnnc1SCC(=O)Nc1ccc(cc1Cl)S(C)(=O)=O
: