Target
Reverse transcriptase protein
Ligand
BDBM50476907
Substrate
Meas. Tech.
ChEMBL_447798 (CHEMBL896807)
IC50
44±n/a nM
Citation
 Gagnon, AAmad, MHBonneau, PRCoulombe, RDeRoy, PLDoyon, LDuan, JGarneau, MGuse, IJakalian, AJolicoeur, ELandry, SMalenfant, ESimoneau, BYoakim, C Thiotetrazole alkynylacetanilides as potent and bioavailable non-nucleoside inhibitors of the HIV-1 wild type and K103N/Y181C double mutant reverse transcriptases. Bioorg Med Chem Lett 17:4437-41 (2007)  
Target
Name:
Reverse transcriptase protein
Synonyms:
Reverse Transcriptase Reverse Transcriptase (F61A)
Type:
Protein
Mol. Mass.:
30203.56
Organism:
Human immunodeficiency virus 1
Description:
Q9WJQ2
Residue:
259
  
Inhibitor
Name:
BDBM50476907
Synonyms:
CHEMBL393191
Type:
Small organic molecule
Emp. Form.:
C20H15Cl2N5OS
Mol. Mass.:
444.337
SMILES:
Clc1cc(ccc1NC(=O)CSc1nnnn1-c1ccc(cc1Cl)C1CC1)C#C
: