Target
Reverse transcriptase
Ligand
BDBM27606
Substrate
Meas. Tech.
ChEMBL_447797 (CHEMBL896806)
IC50
9.5±n/a nM
Citation
 Gagnon, AAmad, MHBonneau, PRCoulombe, RDeRoy, PLDoyon, LDuan, JGarneau, MGuse, IJakalian, AJolicoeur, ELandry, SMalenfant, ESimoneau, BYoakim, C Thiotetrazole alkynylacetanilides as potent and bioavailable non-nucleoside inhibitors of the HIV-1 wild type and K103N/Y181C double mutant reverse transcriptases. Bioorg Med Chem Lett 17:4437-41 (2007)  
Target
Name:
Reverse transcriptase
Synonyms:
Type:
Protein
Mol. Mass.:
29598.37
Organism:
Human immunodeficiency virus 1
Description:
Q9WKE8
Residue:
254
  
Inhibitor
Name:
BDBM27606
Synonyms:
2-{[1-(naphthalen-1-yl)-1H-1,2,3,4-tetrazol-5-yl]sulfanyl}-N-(2-nitrophenyl)acetamide tetrazolyl compound, 1
Type:
Small organic molecule
Emp. Form.:
C19H14N6O3S
Mol. Mass.:
406.418
SMILES:
[O-][N+](=O)c1ccccc1NC(=O)CSc1nnnn1-c1cccc2ccccc12
: