Target
Reverse transcriptase protein
Ligand
BDBM50476903
Substrate
Meas. Tech.
ChEMBL_447798 (CHEMBL896807)
IC50
26±n/a nM
Citation
 Gagnon, AAmad, MHBonneau, PRCoulombe, RDeRoy, PLDoyon, LDuan, JGarneau, MGuse, IJakalian, AJolicoeur, ELandry, SMalenfant, ESimoneau, BYoakim, C Thiotetrazole alkynylacetanilides as potent and bioavailable non-nucleoside inhibitors of the HIV-1 wild type and K103N/Y181C double mutant reverse transcriptases. Bioorg Med Chem Lett 17:4437-41 (2007)  
Target
Name:
Reverse transcriptase protein
Synonyms:
Reverse Transcriptase Reverse Transcriptase (F61A)
Type:
Protein
Mol. Mass.:
30203.56
Organism:
Human immunodeficiency virus 1
Description:
Q9WJQ2
Residue:
259
  
Inhibitor
Name:
BDBM50476903
Synonyms:
CHEMBL230188
Type:
Small organic molecule
Emp. Form.:
C20H21Cl2N5O3S2
Mol. Mass.:
514.448
SMILES:
CC(C)(C)c1ccc(c(Cl)c1)-n1nnnc1SCC(=O)Nc1ccc(cc1Cl)S(C)(=O)=O
: