Target
ATP-sensitive inward rectifier potassium channel 11
Ligand
BDBM50477271
Substrate
Meas. Tech.
ChEMBL_451753 (CHEMBL901965)
EC50
457±n/a nM
Citation
 Perez-Medrano, ABrune, MEBuckner, SACoghlan, MJFey, TAGopalakrishnan, MGregg, RJKort, MEScott, VESullivan, JPWhiteaker, KLCarroll, WA Structure-activity studies of novel cyanoguanidine ATP-sensitive potassium channel openers for the treatment of overactive bladder. J Med Chem 50:6265-73 (2007)  
Target
Name:
ATP-sensitive inward rectifier potassium channel 11
Synonyms:
ATP-sensitive inward rectifier potassium channel 11 Inward rectifier K(+) channel Kir6.2 KCNJ11 Potassium channel, inwardly rectifying, subfamily J, member 11 Sulfonylurea receptor 2, Kir6.2
Type:
Enzyme Catalytic Domain
Mol. Mass.:
43549.41
Organism:
Homo sapiens (Human)
Description:
Potassium channel (ATP modulatory) 0 0::Q14654
Residue:
390
  
Inhibitor
Name:
BDBM50477271
Synonyms:
CHEMBL239514
Type:
Small organic molecule
Emp. Form.:
C17H14Cl4N6O
Mol. Mass.:
460.145
SMILES:
CC(Cl)(Cl)C(N\C(Nc1ccc(Cl)nc1)=N\C#N)NC(=O)c1ccc(Cl)cc1
: