Target
Presenilin-1
Ligand
BDBM50478059
Substrate
Meas. Tech.
ChEMBL_466309 (CHEMBL947026)
IC50
40±n/a nM
Citation
 Kitas, EAGalley, GJakob-Roetne, RFlohr, AWostl, WMauser, HAlker, AMCzech, COzmen, LDavid-Pierson, PReinhardt, DJacobsen, H Substituted 2-oxo-azepane derivatives are potent, orally active gamma-secretase inhibitors. Bioorg Med Chem Lett 18:304-8 (2008)  
Target
Name:
Presenilin-1
Synonyms:
3.4.23.- Gamma-Secretase Subunit Presenilin-1 PS1 PSEN1 PSNL1 Presenilin-1 CTF12 Protein S182
Type:
Mol. Mass.:
52657.13
Organism:
Homo sapiens (Human)
Description:
P49768
Residue:
467
  
Inhibitor
Name:
BDBM50478059
Synonyms:
CHEMBL256596
Type:
Small organic molecule
Emp. Form.:
C26H32ClN3O4S
Mol. Mass.:
518.068
SMILES:
CC(C)C1CCNC(=O)C(C1)N(Cc1ccc(cc1)C(=O)NC1CC1)S(=O)(=O)c1ccc(Cl)cc1
: