Target
Presenilin-1
Ligand
BDBM50478061
Substrate
Meas. Tech.
ChEMBL_466309 (CHEMBL947026)
IC50
8.0±n/a nM
Citation
 Kitas, EAGalley, GJakob-Roetne, RFlohr, AWostl, WMauser, HAlker, AMCzech, COzmen, LDavid-Pierson, PReinhardt, DJacobsen, H Substituted 2-oxo-azepane derivatives are potent, orally active gamma-secretase inhibitors. Bioorg Med Chem Lett 18:304-8 (2008)  
Target
Name:
Presenilin-1
Synonyms:
3.4.23.- Gamma-Secretase Subunit Presenilin-1 PS1 PSEN1 PSNL1 Presenilin-1 CTF12 Protein S182
Type:
Mol. Mass.:
52657.13
Organism:
Homo sapiens (Human)
Description:
P49768
Residue:
467
  
Inhibitor
Name:
BDBM50478061
Synonyms:
CHEMBL439242
Type:
Small organic molecule
Emp. Form.:
C20H23ClN2O5S
Mol. Mass.:
438.925
SMILES:
CC(C)C[C@@H](N(Cc1ccc2OCOc2c1)S(=O)(=O)c1ccc(Cl)cc1)C(N)=O
: