Target
Presenilin-1
Ligand
BDBM50478070
Substrate
Meas. Tech.
ChEMBL_466309 (CHEMBL947026)
IC50
80±n/a nM
Citation
 Kitas, EAGalley, GJakob-Roetne, RFlohr, AWostl, WMauser, HAlker, AMCzech, COzmen, LDavid-Pierson, PReinhardt, DJacobsen, H Substituted 2-oxo-azepane derivatives are potent, orally active gamma-secretase inhibitors. Bioorg Med Chem Lett 18:304-8 (2008)  
Target
Name:
Presenilin-1
Synonyms:
3.4.23.- Gamma-Secretase Subunit Presenilin-1 PS1 PSEN1 PSNL1 Presenilin-1 CTF12 Protein S182
Type:
Mol. Mass.:
52657.13
Organism:
Homo sapiens (Human)
Description:
P49768
Residue:
467
  
Inhibitor
Name:
BDBM50478070
Synonyms:
CHEMBL403279
Type:
Small organic molecule
Emp. Form.:
C20H22ClN3O4S
Mol. Mass.:
435.924
SMILES:
NC(=O)c1ccc(CN([C@@H]2CCCCNC2=O)S(=O)(=O)c2ccc(Cl)cc2)cc1
: