Target
Protease
Ligand
BDBM50478133
Substrate
Meas. Tech.
ChEMBL_469686 (CHEMBL946814)
Ki
0.75±n/a nM
Citation
 Mimoto, TNojima, STerashima, KTakaku, HShintani, MHayashi, H Structure-activity relationships of novel HIV-1 protease inhibitors containing the 3-amino-2-chlorobenzoyl-allophenylnorstatine structure. Bioorg Med Chem 16:1299-308 (2008)  
Target
Name:
Protease
Synonyms:
Type:
Enzyme
Mol. Mass.:
10904.79
Organism:
Human immunodeficiency virus 1 (HIV-1)
Description:
Q9YQ12
Residue:
99
  
Inhibitor
Name:
BDBM50478133
Synonyms:
CHEMBL272796
Type:
Small organic molecule
Emp. Form.:
C34H41ClN4O5
Mol. Mass.:
621.166
SMILES:
COc1cccc(C[C@H](NC(=O)c2cccc(N)c2Cl)[C@H](O)C(=O)N2CCC(C)(C)[C@H]2C(=O)NCc2c(C)cccc2C)c1
: