Target
Protease
Ligand
BDBM50478137
Substrate
Meas. Tech.
ChEMBL_469686 (CHEMBL946814)
Ki
0.163±n/a nM
Citation
 Mimoto, TNojima, STerashima, KTakaku, HShintani, MHayashi, H Structure-activity relationships of novel HIV-1 protease inhibitors containing the 3-amino-2-chlorobenzoyl-allophenylnorstatine structure. Bioorg Med Chem 16:1299-308 (2008)  
Target
Name:
Protease
Synonyms:
Type:
Enzyme
Mol. Mass.:
10904.79
Organism:
Human immunodeficiency virus 1 (HIV-1)
Description:
Q9YQ12
Residue:
99
  
Inhibitor
Name:
BDBM50478137
Synonyms:
CHEMBL271391
Type:
Small organic molecule
Emp. Form.:
C32H35ClN4O6S
Mol. Mass.:
639.161
SMILES:
Cc1ccccc1CNC(=O)[C@H]1N(CSC1(C)C)C(=O)[C@@H](O)[C@H](Cc1ccc2OCOc2c1)NC(=O)c1cccc(N)c1Cl
: