Target
Mast/stem cell growth factor receptor Kit
Ligand
BDBM50501882
Substrate
Meas. Tech.
ChEMBL_1805752 (CHEMBL4305111)
EC50
34±n/a nM
Citation
 Liu, XWang, BChen, CQi, ZZou, FWang, JHu, CWang, AGe, JLiu, QYu, KHu, ZJiang, ZWang, WWang, LWang, WRen, TBai, MLiu, QLiu, J Discovery of ( E)- N J Med Chem 62:5006-5024 (2019)  
Target
Name:
Mast/stem cell growth factor receptor Kit
Synonyms:
CD117 antigen KIT Mast/stem cell growth factor receptor Kit (cKIT) Proto-oncogene tyrosine-protein kinase Kit Stem cell growth factor receptor Tyrosine-protein kinase Kit c-kit v-kit Hardy-Zuckerman 4 feline sarcoma viral oncogene homolog
Type:
Protein
Mol. Mass.:
109869.37
Organism:
Homo sapiens (Human)
Description:
P10721
Residue:
976
  
Inhibitor
Name:
BDBM50501882
Synonyms:
CHEMBL4446361
Type:
Small organic molecule
Emp. Form.:
C23H18FN5O2
Mol. Mass.:
415.4197
SMILES:
Fc1cccc(NC(=O)CC(=O)Nc2ccc3c(\C=C\c4ccccn4)n[nH]c3c2)c1
: