Target
CAAX prenyl protease 2
Ligand
BDBM50480669
Substrate
Meas. Tech.
ChEMBL_579183 (CHEMBL1055573)
IC50
>198000±n/a nM
Citation
 Williams, DEHollander, IFeldberg, LFrommer, EMallon, RTahir, Avan Soest, RAndersen, RJ Scalarane-based sesterterpenoid RCE-protease inhibitors isolated from the Indonesian marine sponge Carteriospongia foliascens. J Nat Prod 72:1106-9 (2009)  
Target
Name:
CAAX prenyl protease 2
Synonyms:
CAAX prenyl protease 2 FACE2 Farnesylated proteins-converting enzyme 2 Prenyl protein-specific endoprotease 2 RCE1 homolog RCE1B | hRCE1
Type:
PROTEIN
Mol. Mass.:
35839.94
Organism:
Homo sapiens (Human)
Description:
ChEMBL_194935
Residue:
329
  
Inhibitor
Name:
BDBM50480669
Synonyms:
CHEMBL558514
Type:
Small organic molecule
Emp. Form.:
C31H50O5
Mol. Mass.:
502.7257
SMILES:
[H][C@@]12CC[C@]3(C)[C@]([H])(C[C@H](OC(=O)CC(O)CC)[C@]4(C)C=C([C@H](O)C[C@@]34[H])C(C)=O)[C@@]1(C)CCC[C@]2(C)CC
: