Target
CAAX prenyl protease 2
Ligand
BDBM50480670
Substrate
Meas. Tech.
ChEMBL_579183 (CHEMBL1055573)
IC50
7300±n/a nM
Citation
 Williams, DEHollander, IFeldberg, LFrommer, EMallon, RTahir, Avan Soest, RAndersen, RJ Scalarane-based sesterterpenoid RCE-protease inhibitors isolated from the Indonesian marine sponge Carteriospongia foliascens. J Nat Prod 72:1106-9 (2009)  
Target
Name:
CAAX prenyl protease 2
Synonyms:
CAAX prenyl protease 2 FACE2 Farnesylated proteins-converting enzyme 2 Prenyl protein-specific endoprotease 2 RCE1 homolog RCE1B | hRCE1
Type:
PROTEIN
Mol. Mass.:
35839.94
Organism:
Homo sapiens (Human)
Description:
ChEMBL_194935
Residue:
329
  
Inhibitor
Name:
BDBM50480670
Synonyms:
CHEMBL553161
Type:
Small organic molecule
Emp. Form.:
C34H54O7
Mol. Mass.:
574.7884
SMILES:
[H][C@@]12CC[C@]3(C)[C@]([H])(C[C@H](OC(=O)CC(O)CC)[C@]4(C)C5=C([C@@H](C[C@@]34[H])OCC)C(C)(O)OC5=O)[C@@]1(C)CCC[C@]2(C)CC
: