Target
Serine/threonine-protein kinase B-raf
Ligand
BDBM142606
Substrate
Meas. Tech.
ChEMBL_646978 (CHEMBL1217119)
IC50
99±n/a nM
Citation
 Zambon, AMénard, DSuijkerbuijk, BMNiculescu-Duvaz, IWhittaker, SNiculescu-Duvaz, DNourry, ADavies, LManne, HALopes, FPreece, NHedley, DOgilvie, LMKirk, RMarais, RSpringer, CJ Novel hinge binder improves activity and pharmacokinetic properties of BRAF inhibitors. J Med Chem 53:5639-55 (2010)  
Target
Name:
Serine/threonine-protein kinase B-raf
Synonyms:
B-RAF B-Raf proto-oncogene serine/threonine-protein kinase BRAF1 RAFB1 v-Raf murine sarcoma viral oncogene homolog B1
Type:
Serine/threonine-protein kinase
Mol. Mass.:
84446.00
Organism:
Homo sapiens (Human)
Description:
P15056
Residue:
766
  
Inhibitor
Name:
BDBM142606
Synonyms:
US8933228, 8
Type:
Small organic molecule
Emp. Form.:
C33H31N7O3
Mol. Mass.:
573.6443
SMILES:
Cc1ccc(cc1)-n1nc(cc1NC(=O)Nc1ccc(Oc2ccnc3[nH]c(=O)c(C)nc23)c2ccccc12)C(C)(C)C
: