Target
E3 ubiquitin-protein ligase XIAP
Ligand
BDBM50501947
Substrate
Meas. Tech.
ChEMBL_1806078 (CHEMBL4305437)
IC50
3.5±n/a nM
Citation
 Gambini, LBaggio, CUdompholkul, PJossart, JSalem, AFPerry, JJPPellecchia, M Covalent Inhibitors of Protein-Protein Interactions Targeting Lysine, Tyrosine, or Histidine Residues. J Med Chem 62:5616-5627 (2019)  
Target
Name:
E3 ubiquitin-protein ligase XIAP
Synonyms:
API3 E3 ubiquitin-protein ligase XIAP Inhibitor of apoptosis protein 3 X-linked inhibitor of apoptosis XIAP | XIAP_HUMAN
Type:
Protein
Mol. Mass.:
56685.27
Organism:
Homo sapiens (Human)
Description:
P98170
Residue:
497
  
Inhibitor
Name:
BDBM50501947
Synonyms:
CHEMBL4443905
Type:
Small organic molecule
Emp. Form.:
C28H35F2N5O5S
Mol. Mass.:
591.67
SMILES:
CN[C@@H](C)C(=O)N[C@@H](CNCc1ccc(cc1)S(F)(=O)=O)C(=O)N1CCC[C@H]1C(=O)N[C@@H]1CCc2c1cccc2F
: