Target
Neuraminidase
Ligand
BDBM50482872
Substrate
Meas. Tech.
ChEMBL_675044 (CHEMBL1272778)
Ki
24900±n/a nM
Citation
 Dao, TTTung, BTNguyen, PHThuong, PTYoo, SSKim, EHKim, SKOh, WK C-Methylated Flavonoids from Cleistocalyx operculatus and Their Inhibitory Effects on Novel Influenza A (H1N1) Neuraminidase. J Nat Prod 73:1636-42 (2010)  
Target
Name:
Neuraminidase
Synonyms:
NA | NRAM_I33A0
Type:
PROTEIN
Mol. Mass.:
49687.56
Organism:
Influenza A virus
Description:
ChEMBL_1347422
Residue:
453
  
Inhibitor
Name:
BDBM50482872
Synonyms:
CHEBI:70655 | CHEMBL1271157
Type:
Small organic molecule
Emp. Form.:
C18H18O5
Mol. Mass.:
314.3325
SMILES:
COc1c(C)c(O)c(C)c(O)c1C(=O)\C=C\c1ccc(O)cc1
: