Target
Neuraminidase
Ligand
BDBM50370984
Substrate
Meas. Tech.
ChEMBL_676153 (CHEMBL1273204)
Ki
68700±n/a nM
Citation
 Nguyen, PHNa, MDao, TTNdinteh, DTMbafor, JTPark, JCheong, HOh, WK New stilbenoid with inhibitory activity on viral neuraminidases from Erythrina addisoniae. Bioorg Med Chem Lett 20:6430-4 (2010)  
Target
Name:
Neuraminidase
Synonyms:
NA | NRAM_I33A0
Type:
PROTEIN
Mol. Mass.:
49687.56
Organism:
Influenza A virus
Description:
ChEMBL_1347422
Residue:
453
  
Inhibitor
Name:
BDBM50370984
Synonyms:
Abyssinone Vi | CHEMBL508727
Type:
Small organic molecule
Emp. Form.:
C25H28O4
Mol. Mass.:
392.4874
SMILES:
[#6]\[#6](-[#6])=[#6]\[#6]-c1cc(\[#6]=[#6]\[#6](=O)-c2ccc(-[#8])cc2-[#8])cc(-[#6]\[#6]=[#6](\[#6])-[#6])c1-[#8]
: