Target
Neuraminidase
Ligand
BDBM50212400
Substrate
Meas. Tech.
ChEMBL_676153 (CHEMBL1273204)
Ki
67800±n/a nM
Citation
 Nguyen, PHNa, MDao, TTNdinteh, DTMbafor, JTPark, JCheong, HOh, WK New stilbenoid with inhibitory activity on viral neuraminidases from Erythrina addisoniae. Bioorg Med Chem Lett 20:6430-4 (2010)  
Target
Name:
Neuraminidase
Synonyms:
NA | NRAM_I33A0
Type:
PROTEIN
Mol. Mass.:
49687.56
Organism:
Influenza A virus
Description:
ChEMBL_1347422
Residue:
453
  
Inhibitor
Name:
BDBM50212400
Synonyms:
1-(2,4-Dihydroxyphenyl)-3-[4-hydroxy-3-(3-methylbut-2-enyl)phenyl]-prop-2-en-1-one CHEMBL229885 | licoagrochalcone A
Type:
Small organic molecule
Emp. Form.:
C20H20O4
Mol. Mass.:
324.3704
SMILES:
[#6]\[#6](-[#6])=[#6]/[#6]-c1cc(\[#6]=[#6]\[#6](=O)-c2ccc(-[#8])cc2-[#8])ccc1-[#8]
: