Target
Neuraminidase
Ligand
BDBM50483016
Substrate
Meas. Tech.
ChEMBL_676153 (CHEMBL1273204)
Ki
32600±n/a nM
Citation
 Nguyen, PHNa, MDao, TTNdinteh, DTMbafor, JTPark, JCheong, HOh, WK New stilbenoid with inhibitory activity on viral neuraminidases from Erythrina addisoniae. Bioorg Med Chem Lett 20:6430-4 (2010)  
Target
Name:
Neuraminidase
Synonyms:
NA | NRAM_I33A0
Type:
PROTEIN
Mol. Mass.:
49687.56
Organism:
Influenza A virus
Description:
ChEMBL_1347422
Residue:
453
  
Inhibitor
Name:
BDBM50483016
Synonyms:
ERYTHRADDISON B
Type:
Small organic molecule
Emp. Form.:
C17H16O5
Mol. Mass.:
300.3059
SMILES:
COc1ccc(\C(C=O)=C/c2ccc(O)cc2OC)c(O)c1
: