Target
Histamine H1 receptor
Ligand
BDBM50403672
Substrate
Meas. Tech.
ChEMBL_697505 (CHEMBL1638837)
EC50
251±n/a nM
Citation
 Igel, PDove, SBuschauer, A Histamine H4 receptor agonists. Bioorg Med Chem Lett 20:7191-9 (2010)  
Target
Name:
Histamine H1 receptor
Synonyms:
H1R HISTAMINE H1 HRH1_HUMAN
Type:
G Protein-Coupled Receptor (GPCR)
Mol. Mass.:
55808.72
Organism:
Homo sapiens (Human)
Description:
Cell pellets from SK-N-MC cells transfected with human H1 receptor were used in binding assay.
Residue:
487
  
Inhibitor
Name:
BDBM50403672
Synonyms:
CHEMBL24665
Type:
Small organic molecule
Emp. Form.:
C12H12F3N3
Mol. Mass.:
255.239
SMILES:
NCCc1cnc([nH]1)-c1cccc(c1)C(F)(F)F
: