Target
Sialidase
Ligand
BDBM50253160
Substrate
Meas. Tech.
ChEMBL_698049 (CHEMBL1645800)
IC50
1120±n/a nM
Citation
 Dao, TTNguyen, PHLee, HSKim, EPark, JLim, SIOh, WK Chalcones as novel influenza A (H1N1) neuraminidase inhibitors from Glycyrrhiza inflata. Bioorg Med Chem Lett 21:294-8 (2011)  
Target
Name:
Sialidase
Synonyms:
NANH_CLOPF | nanH
Type:
PROTEIN
Mol. Mass.:
42808.79
Organism:
Clostridium perfringens
Description:
ChEMBL_991336
Residue:
382
  
Inhibitor
Name:
BDBM50253160
Synonyms:
Kanzonol C
Type:
Small organic molecule
Emp. Form.:
C25H28O4
Mol. Mass.:
392.4874
SMILES:
[#6]\[#6](-[#6])=[#6]\[#6]-c1cc(\[#6]=[#6]\[#6](=O)-c2ccc(-[#8])c(-[#6]\[#6]=[#6](\[#6])-[#6])c2-[#8])ccc1-[#8]
: