Target
Probable maltase-glucoamylase 2
Ligand
BDBM181063
Substrate
Meas. Tech.
ChEMBL_1806317 (CHEMBL4305676)
IC50
6200±n/a nM
Citation
 Dhameja, MGupta, P Synthetic heterocyclic candidates as promising ?-glucosidase inhibitors: An overview. Eur J Med Chem 176:343-377 (2019)  
Target
Name:
Probable maltase-glucoamylase 2
Synonyms:
3.2.1.3 Glucoamylase MGAM2 Probable maltase-glucoamylase 2
Type:
PROTEIN
Mol. Mass.:
277932.17
Organism:
Homo sapiens
Description:
ChEMBL_116927
Residue:
2515
  
Inhibitor
Name:
BDBM181063
Synonyms:
(E)-N'-(3-Fluoro-4-hydroxybenzylidene)-4-(2-oxo-2Hchromen-3-yl)thiazole-2-carbohydrazide (7g)
Type:
Small organic molecule
Emp. Form.:
C20H12FN3O4S
Mol. Mass.:
409.39
SMILES:
Oc1ccc(\C=N\NC(=O)c2nc(cs2)-c2cc3ccccc3oc2=O)cc1F
: