Target
Cyclin-dependent kinase 2/G1/S-specific cyclin-E1
Ligand
BDBM5718
Substrate
Meas. Tech.
ChEMBL_830564 (CHEMBL2061419)
IC50
5000±n/a nM
Citation
 Huang, XFLu, XZhang, YSong, GQHe, QLLi, QSYang, XHWei, YZhu, HL Synthesis, biological evaluation, and molecular docking studies of N-((1,3-diphenyl-1H-pyrazol-4-yl)methyl)aniline derivatives as novel anticancer agents. Bioorg Med Chem 20:4895-900 (2012)  
Target
Name:
Cyclin-dependent kinase 2/G1/S-specific cyclin-E1
Synonyms:
CDK2/CycE CDK2/E Cyclin-Dependent Kinase 2 (CDK2) Cyclin-dependent kinase 2/cyclin E1
Type:
Protein
Mol. Mass.:
Description:
Components:
This complex has 2 components.
Component 1
Name:
Cyclin-dependent kinase 2
Synonyms:
CDK2 CDK2_HUMAN Cell division protein kinase 2 Protein cereblon/Cyclin-dependent kinase 2 | p33 protein kinase
Type:
Enzyme Subunit
Mol. Mass.:
33938.17
Organism:
Homo sapiens (Human)
Description:
P24941
Residue:
298
  
Component 2
Name:
G1/S-specific cyclin-E1
Synonyms:
CCNE CCNE1_HUMAN
Type:
Enzyme Subunit
Mol. Mass.:
47073.17
Organism:
Homo sapiens (Human)
Description:
Residue:
410
  
Inhibitor
Name:
BDBM5718
Synonyms:
2,6,9-Trisubstituted purine deriv. 26 2-{[6-(benzylamino)-9-methyl-9H-purin-2-yl]amino}ethanol CHEMBL280074 purine deriv. 5
Type:
Small organic molecule
Emp. Form.:
C15H18N6O
Mol. Mass.:
298.343
SMILES:
Cn1cnc2c(NCc3ccccc3)nc(NCCO)nc12
: