Target
Solute carrier family 15 member 1
Ligand
BDBM50350467
Substrate
Meas. Tech.
ChEMBL_838001 (CHEMBL2075259)
Ki
1450000±n/a nM
Citation
 Wenzel, UGebert, IWeintraut, HWeber, WMClauss, WDaniel, H Transport characteristics of differently charged cephalosporin antibiotics in oocytes expressing the cloned intestinal peptide transporter PepT1 and in human intestinal Caco-2 cells. J Pharmacol Exp Ther 277:831-9 (1996) Target
Name:
Solute carrier family 15 member 1
Synonyms:
Intestinal H(+)/peptide cotransporter Oligopeptide transporter, small intestine isoform Peptide transporter 1 SLC15A1
Type:
PROTEIN
Mol. Mass.:
78818.07
Organism:
Homo sapiens (Human)
Description:
ChEMBL_1488839
Residue:
708
  
Inhibitor
Name:
BDBM50350467
Synonyms:
BL-S578 Cefadrops
Type:
Small organic molecule
Emp. Form.:
C16H17N3O5S
Mol. Mass.:
363.388
SMILES:
CC1=C(N2[C@H](SC1)[C@H](NC(=O)[C@H](N)c1ccc(O)cc1)C2=O)C(O)=O
: