Target
ATP-dependent translocase ABCB1
Ligand
BDBM50344942
Substrate
Meas. Tech.
ChEMBL_838277 (CHEMBL2076225)
Ki
>1000000±n/a nM
Citation
 Yasuda, KLan, LBSanglard, DFuruya, KSchuetz, JDSchuetz, EG Interaction of cytochrome P450 3A inhibitors with P-glycoprotein. J Pharmacol Exp Ther 303:323-32 (2002)  
Target
Name:
ATP-dependent translocase ABCB1
Synonyms:
ATP-binding cassette sub-family B member 1 Abcb1b MDR1B_MOUSE Mdr1b P-glycoprotein 1 Pgy1 | Pgy1-1
Type:
PROTEIN
Mol. Mass.:
141009.67
Organism:
Mus musculus
Description:
ChEMBL_474396
Residue:
1276
  
Inhibitor
Name:
BDBM50344942
Synonyms:
CHEMBL532 ERYTHROMYCIN Erycette Erythromycin A Ilotycin | T-Stat
Type:
Small organic molecule
Emp. Form.:
C37H67NO13
Mol. Mass.:
733.9268
SMILES:
CC[C@H]1OC(=O)[C@H](C)[C@@H](O[C@H]2C[C@@](C)(OC)[C@@H](O)[C@H](C)O2)[C@H](C)[C@@H](O[C@@H]2O[C@H](C)C[C@@H]([C@H]2O)N(C)C)[C@](C)(O)C[C@@H](C)C(=O)[C@H](C)[C@@H](O)[C@]1(C)O
: