Target
Alpha-1A adrenergic receptor
Ligand
BDBM50475534
Substrate
Meas. Tech.
ChEMBL_900820 (CHEMBL3049693)
Ki
0.251000±n/a nM
Citation
  TBA Med Chem Res 20:1455-1464 (2011)    Article 
Target
Name:
Alpha-1A adrenergic receptor
Synonyms:
ADA1A_HUMAN ADRA1C Alpha 1A-adrenoceptor Alpha adrenergic receptor 1a Alpha-adrenergic receptor 1c adrenergic Alpha1 | adrenergic Alpha1C
Type:
Cell-surface receptors
Mol. Mass.:
51511.67
Organism:
Homo sapiens (Human)
Description:
P35348
Residue:
466
  
Inhibitor
Name:
BDBM50475534
Synonyms:
CHEMBL198860
Type:
Small organic molecule
Emp. Form.:
C25H28ClNO5
Mol. Mass.:
457.947
SMILES:
COc1cccc(OC)c1OCCNCCOc1ccccc1OCc1cccc(Cl)c1
: