Target
Proto-oncogene tyrosine-protein kinase Src
Ligand
BDBM50029329
Substrate
Meas. Tech.
ChEMBL_202790 (CHEMBL808044)
IC50
3200±n/a nM
Citation
 Ye, BAkamatsu, MShoelson, SEWolf, GGiorgetti-Peraldi, SYan, XRoller, PPBurke, TR L-O-(2-malonyl)tyrosine: a new phosphotyrosyl mimetic for the preparation of Src homology 2 domain inhibitory peptides. J Med Chem 38:4270-5 (1995)  
Target
Name:
Proto-oncogene tyrosine-protein kinase Src
Synonyms:
Calmodulin/Proto-oncogene tyrosine-protein kinase Src Proto-oncogene c-Src SRC SRC_HUMAN V-src sarcoma (Schmidt-Ruppin A-2) viral oncogene homolog (avian) p60-Src | pp60c-src
Type:
Protein
Mol. Mass.:
59838.60
Organism:
Homo sapiens (Human)
Description:
P12931
Residue:
536
  
Inhibitor
Name:
BDBM50029329
Synonyms:
(S)-4-{(S)-2-[(S)-2-((S)-2-Acetylamino-4-carbamoyl-butyrylamino)-3-(4-phosphonooxy-phenyl)-propionylamino]-4-carboxy-butyrylamino}-4-[(1S,2S)-1-((S)-2-carbamoyl-pyrrolidine-1-carbonyl)-2-methyl-butylcarbamoyl]-butyric acid | CHEMBL134928
Type:
Small organic molecule
Emp. Form.:
C37H55N8O16P
Mol. Mass.:
898.8504
SMILES:
CC[C@H](C)[C@H](NC(=O)[C@H](CCC(O)=O)NC(=O)[C@H](CCC(O)=O)NC(=O)[C@H](Cc1ccc(OP(O)(O)=O)cc1)NC(=O)[C@H](CCC(N)=O)NC(C)=O)C(=O)N1CCC[C@H]1C(N)=O
: