Target
Proto-oncogene tyrosine-protein kinase Src
Ligand
BDBM50029331
Substrate
Meas. Tech.
ChEMBL_202790 (CHEMBL808044)
IC50
22800±n/a nM
Citation
 Ye, BAkamatsu, MShoelson, SEWolf, GGiorgetti-Peraldi, SYan, XRoller, PPBurke, TR L-O-(2-malonyl)tyrosine: a new phosphotyrosyl mimetic for the preparation of Src homology 2 domain inhibitory peptides. J Med Chem 38:4270-5 (1995)  
Target
Name:
Proto-oncogene tyrosine-protein kinase Src
Synonyms:
Calmodulin/Proto-oncogene tyrosine-protein kinase Src Proto-oncogene c-Src SRC SRC_HUMAN V-src sarcoma (Schmidt-Ruppin A-2) viral oncogene homolog (avian) p60-Src | pp60c-src
Type:
Protein
Mol. Mass.:
59838.60
Organism:
Homo sapiens (Human)
Description:
P12931
Residue:
536
  
Inhibitor
Name:
BDBM50029331
Synonyms:
2-[4-(2-[2-(2-Acetylamino-4-carbamoyl-butyrylamino)-3-(4-dicarboxymethoxy-phenyl)-propionylamino]-2-{1-[1-(2-carbamoyl-pyrrolidine-1-carbonyl)-2-methyl-butylcarbamoyl]-3-carboxy-propylcarbamoyl}-ethyl)-phenoxy]-malonic acid | CHEMBL437529
Type:
Small organic molecule
Emp. Form.:
C47H60N8O20
Mol. Mass.:
1057.0209
SMILES:
CC[C@H](C)[C@H](NC(=O)[C@H](CCC(O)=O)NC(=O)[C@H](Cc1ccc(OC(C(O)=O)C(O)=O)cc1)NC(=O)[C@H](Cc1ccc(OC(C(O)=O)C(O)=O)cc1)NC(=O)[C@H](CCC(N)=O)NC(C)=O)C(=O)N1CCC[C@H]1C(N)=O
: