Target
Tyrosine-protein phosphatase non-receptor type 11
Ligand
BDBM50029332
Substrate
Meas. Tech.
ChEMBL_198724 (CHEMBL805163)
IC50
22000±n/a nM
Citation
 Ye, BAkamatsu, MShoelson, SEWolf, GGiorgetti-Peraldi, SYan, XRoller, PPBurke, TR L-O-(2-malonyl)tyrosine: a new phosphotyrosyl mimetic for the preparation of Src homology 2 domain inhibitory peptides. J Med Chem 38:4270-5 (1995)  
Target
Name:
Tyrosine-protein phosphatase non-receptor type 11
Synonyms:
3.1.3.48 PTP-1D PTP2C Protein Tyrosine Phosphatase PPN11/Shp2 Protein-Tyrosine Phosphatase SHP-2 Protein-tyrosine phosphatase 2C SH-PTP3 SHP2 Src homology phosphatase 2 (SHP-2) Tyrosine-protein phosphatase non-receptor type 11 (SHP-2) | Tyrosine-protein phosphatase non-receptor type 11 (SHP2)
Type:
Protein phosphatase
Mol. Mass.:
68443.59
Organism:
Homo sapiens (Human)
Description:
Q06124
Residue:
593
  
Inhibitor
Name:
BDBM50029332
Synonyms:
Ac-L-N-OMT-I-D-L-D-L-V-amide | CHEMBL263010
Type:
Small organic molecule
Emp. Form.:
C55H85N11O20
Mol. Mass.:
1220.3251
SMILES:
CC[C@H](C)[C@H](NC(=O)[C@H](Cc1ccc(OC(C(O)=O)C(O)=O)cc1)NC(=O)[C@H](CC(N)=O)NC(=O)[C@H](CC(C)C)NC(C)=O)C(=O)N[C@@H](CC(O)=O)C(=O)N[C@@H](CC(C)C)C(=O)N[C@@H](CC(O)=O)C(=O)N[C@@H](CC(C)C)C(=O)N[C@@H](C(C)C)C(N)=O
: