Target
Proto-oncogene tyrosine-protein kinase Src
Ligand
BDBM50029334
Substrate
Meas. Tech.
ChEMBL_202790 (CHEMBL808044)
IC50
25000±n/a nM
Citation
 Ye, BAkamatsu, MShoelson, SEWolf, GGiorgetti-Peraldi, SYan, XRoller, PPBurke, TR L-O-(2-malonyl)tyrosine: a new phosphotyrosyl mimetic for the preparation of Src homology 2 domain inhibitory peptides. J Med Chem 38:4270-5 (1995)  
Target
Name:
Proto-oncogene tyrosine-protein kinase Src
Synonyms:
Calmodulin/Proto-oncogene tyrosine-protein kinase Src Proto-oncogene c-Src SRC SRC_HUMAN V-src sarcoma (Schmidt-Ruppin A-2) viral oncogene homolog (avian) p60-Src | pp60c-src
Type:
Protein
Mol. Mass.:
59838.60
Organism:
Homo sapiens (Human)
Description:
P12931
Residue:
536
  
Inhibitor
Name:
BDBM50029334
Synonyms:
2-{4-[(S)-2-((S)-2-Acetylamino-4-carbamoyl-butyrylamino)-2-((S)-1-{(S)-1-[(1S,2S)-1-((S)-2-carbamoyl-pyrrolidine-1-carbonyl)-2-methyl-butylcarbamoyl]-3-carboxy-propylcarbamoyl}-3-carboxy-propylcarbamoyl)-ethyl]-phenoxy}-malonic acid | CHEMBL135042
Type:
Small organic molecule
Emp. Form.:
C40H56N8O17
Mol. Mass.:
920.916
SMILES:
CC[C@H](C)[C@H](NC(=O)[C@H](CCC(O)=O)NC(=O)[C@H](CCC(O)=O)NC(=O)[C@H](Cc1ccc(OC(C(O)=O)C(O)=O)cc1)NC(=O)[C@H](CCC(N)=O)NC(C)=O)C(=O)N1CCC[C@H]1C(N)=O
: