Target
Leukotriene B4 receptor 1
Ligand
BDBM50029484
Substrate
Meas. Tech.
ChEMBL_99490 (CHEMBL704378)
Ki
42±n/a nM
Citation
 Sawyer, JSBach, NJBaker, SRBaldwin, RFBorromeo, PSCockerham, SLFleisch, JHFloreancig, PFroelich, LLJackson, WT Synthetic and structure/activity studies on acid-substituted 2-arylphenols: discovery of 2-[2-propyl-3-[3-[2-ethyl-4-(4-fluorophenyl)-5- hydroxyphenoxy]-propoxy]phenoxy]benzoic acid, a high-affinity leukotriene B4 receptor antagonist. J Med Chem 38:4411-32 (1995)  
Target
Name:
Leukotriene B4 receptor 1
Synonyms:
BLT BLTR Chemoattractant receptor-like 1 GPR16 LTB4-R 1 Leukotriene B4 R1 Leukotriene B4 receptor 1 P2Y purinoceptor 7 | P2Y7
Type:
Enzyme Catalytic Domain
Mol. Mass.:
37582.68
Organism:
Homo sapiens (Human)
Description:
Q15722
Residue:
352
  
Inhibitor
Name:
BDBM50029484
Synonyms:
2-{3-[3-(5-Ethyl-4'-fluoro-2-hydroxy-biphenyl-4-yloxy)-propoxy]-2-propyl-phenylsulfanyl}-benzoic acid | CHEMBL139254
Type:
Small organic molecule
Emp. Form.:
C33H33FO5S
Mol. Mass.:
560.676
SMILES:
CCCc1c(OCCCOc2cc(O)c(cc2CC)-c2ccc(F)cc2)cccc1Sc1ccccc1C(O)=O
: