Target
Amine oxidase [flavin-containing] A
Ligand
BDBM50029837
Substrate
Meas. Tech.
ChEMBL_122945 (CHEMBL733230)
IC50
>100000±n/a nM
Citation
 Lebreton, LCuret, OGueddari, SMazouz, FBernard, SBurstein, CMilcent, R Selective and potent monoamine oxidase type B inhibitors: 2-substituted 5-aryltetrazole derivatives. J Med Chem 38:4786-92 (1996)  
Target
Name:
Amine oxidase [flavin-containing] A
Synonyms:
AOFA_RAT Amine oxidase [flavin-containing] A Monoamine Oxidase Type A (MAO-A) Monoamine oxidase A (MAO-A) Monoamine oxidase type A (MAOA)
Type:
Enzyme
Mol. Mass.:
59515.21
Organism:
Rattus norvegicus (rat)
Description:
Residue:
526
  
Inhibitor
Name:
BDBM50029837
Synonyms:
3-{5-[4-(2-Methyl-benzyloxy)-phenyl]-tetrazol-2-yl}-propionitrile | CHEMBL144971
Type:
Small organic molecule
Emp. Form.:
C18H17N5O
Mol. Mass.:
319.3605
SMILES:
Cc1ccccc1COc1ccc(cc1)-c1nnn(CCC#N)n1
: